{"text_format":"1","workbook":"xlsx","n_sheets":25,"sheets":["Instructions","Analysis","Data","AnnBS","Name","Income","Bond rate","10 Yr PE","Price2","CFlow","G-1","G-1a","G-2","G-2a","G-3","G-3a","G-4","G-5","G-5a","G-6","G-6a","G-7","G-7a","G-8","G-9"],"not_rendered":{"charts":37,"images":1,"macros":1,"external_links":2,"defined_names":53,"comments":1,"pivot_tables":0},"unopened":[],"bounds":{"document_bytes":16777216,"sheet_cells":100000,"rows_first":2000,"rows_last":500,"rows_between":2000,"halvings":0,"cell_chars":16384,"cell_head_chars":4096},"cells_cut":0,"cells_raw":0,"read":"whole","date_system":"1900"}

{"sheet":"Instructions","index":0,"n_rows":31,"n_cols":13,"rows_kept":31,"cut":false,"hidden":false,"merged":[[30,1,30,5],[26,1,26,12],[23,1,23,11],[12,1,12,11],[13,1,13,11],[20,1,20,11],[18,1,18,11],[21,1,21,11],[15,1,15,11],[14,1,14,11],[16,1,16,11],[1,12,1,16],[0,1,0,11],[3,1,3,11],[9,1,9,11],[11,1,11,11],[2,1,2,11],[10,1,10,11],[6,1,6,11],[7,1,7,11],[8,1,8,11],[5,8,5,11],[1,1,1,11]]}
[null,"INSTRUCTIONS:"]
[null,"1.  Type a company ticker symbol in the cell with a blue background and press the Enter key.",null,null,null,null,null,null,null,null,null,null,"Click here to return to the Analysis page"]
[null,"There is a considerable amount of data to be downloaded to complete the analysis."]
[null,"All data will be inserted in the appropriate cells--provided you are logged on to the Internet.  If using a dial-up modem, be patient.  The update may take 15 to 20 seconds. New data will be written over the old data.  There is no need to delete existing data. No password is required to use this tool.  If you are asked for a password you are attempting to enter data into a cell that cannot be changed.  The ticker symbol is the only data entry needed to use the spreadsheet. "]
[]
[null,null,null,null,null,null,null,null,"If data does not update after entering a ticker symbol and pressing the Enter key, look above the top of the spreadsheet for a \"Security Warning\", shown here.   Click the Options box--a drop down menu will appear.  Click the \"Enable this content\" radio button, then OK.  These steps will be required each time the spreadsheet is opened.  It is possible to eliminate this step by authorizing all external data to be accessed but is not recommended as it opens your computer to the possibility of receiving destructive data. "]
[null,"If data are incomplete or you receive an error message of any type when using the form, please check my website for an updated spreadsheet.  This tool relies on websites that are open and offer free data.  They change their site on occasion, causing the automatic download of data feature to stop working.  I normally correct the problem within a few days of becoming aware.  If you notice strange behavior please email me:  bob.at.seattle@gmail.com"]
[]
[null,"HOW TO USE THIS TOOL:  The data presented within this tool is comprehensive and can be overwhelming.  Therefore, I suggest using only portions of the information until you become more experienced with what the various data show.  The most simple approach is to read the \"Bullish Results\" and \"Bearish Results\" in those two boxes.  That verbiage will steer you to additional comments and numerical analysis at the left of the form--when you want to dive in deeper.  To the right of the remarks is a column containing numbers.  The numbers refer to line numbers, found on the extreme left which identify data the remarks are referring to.  Don't feel it's necessary to analyze all the data in this spreadsheet to aid in making decisions about a company.  Use the information that makes sense to you in each learning stage, taking more and more advantage of additional data as your learning experience expands.  The final step in using the data presented on this form are the graphs, accessed by clicking the small purple boxes adjacent to selected information.  (They are also available as tabs at the bottom of the spreadsheet.)  Verbiage explains what to look for on each graph.  Notice there are five year data as well as five quarter graphs--providing a display of long and short term information."]
[null,"The automatic data feature requires being logged on to the Internet when the spreadsheet is opened, and only works with Excel 2000 or newer. If you are using Excel 2007 or newer you must download the file that's to be used with the version of Excel you are using.  Note that there are two versions of the spreadsheet on my site.  As explained on my website Excel 2010 contains a bug which precludes the use of this tool."]
{"$rows_left_out":22}
{"sheet":"Analysis","index":1,"n_rows":102,"n_cols":25,"rows_kept":102,"cut":false,"hidden":false,"merged":[[33,10,33,14],[52,10,52,14],[28,10,28,14],[43,10,43,14],[44,10,44,14],[45,10,45,14],[46,10,46,14],[47,10,47,14],[48,10,48,14],[49,10,49,14],[50,10,50,14],[51,10,51,14],[34,10,34,14],[35,10,35,14],[36,10,36,14],[37,10,37,14],[38,10,38,14],[39,10,39,14],[40,10,40,14],[41,10,41,14],[42,10,42,14],[24,10,24,14],[25,10,25,14],[26,10,26,14],[29,10,29,14],[30,10,30,14],[31,10,31,14],[32,10,32,14],[13,10,13,14],[14,10,14,14],[15,10,15,14],[16,10,16,14],[17,10,17,14],[18,10,18,14],[19,10,19,14],[20,10,20,14],[21,10,21,14],[22,10,22,14],[0,11,0,12],[7,10,7,14],[8,10,8,14],[9,10,9,14],[10,10,10,14],[11,10,11,14],[12,10,12,14],[5,10,5,14],[23,10,23,14],[2,10,2,21],[94,3,94,7],[55,2,55,5],[89,2,89,3],[93,3,93,7],[91,3,91,7],[89,4,89,7],[81,8,81,9],[70,5,70,8],[62,5,62,8],[56,4,56,6],[78,4,78,7],[79,4,79,6],[80,2,80,7],[81,2,81,4],[81,5,81,6],[90,2,90,7],[85,2,85,7],[88,2,88,7],[68,5,68,8],[58,7,58,8],[83,2,83,7],[90,8,90,11],[88,8,88,11],[76,2,76,11],[36,23,36,24],[38,23,38,24],[39,3,39,4],[95,2,95,5],[65,5,65,8],[85,8,85,9],[61,2,61,8],[60,6,60,7],[57,7,57,8],[57,3,57,6],[49,6,49,8],[87,2,87,7],[55,6,55,8],[59,1,59,4],[58,2,58,6],[52,6,52,8],[56,1,56,2],[56,7,56,8],[45,6,45,8],[47,1,47,4],[86,2,86,7],[51,6,51,8],[87,8,87,9],[48,6,48,8],[77,2,77,5],[29,7,29,8],[49,1,49,4],[30,3,30,4],[36,1,36,4],[36,6,36,8],[37,6,37,8],[33,1,33,2],[40,6,40,8],[47,6,47,8],[39,6,39,8],[40,1,40,4],[42,1,42,4],[32,5,32,8],[38,6,38,8],[34,5,34,8],[33,6,33,8],[38,1,38,2],[34,1,34,4],[54,1,54,3],[54,6,54,8],[51,1,51,4],[11,1,11,2],[23,6,23,8],[18,5,18,8],[20,6,20,8],[19,5,19,8],[20,1,20,2],[21,6,21,8],[46,2,46,6],[31,1,31,2],[31,6,31,8],[29,1,29,2],[30,6,30,8],[17,6,17,8],[14,1,14,2],[17,1,17,2],[23,1,23,2],[22,6,22,9],[105,3,105,6],[96,4,96,7],[98,2,98,7],[97,4,97,6],[99,2,99,4],[8,1,8,3],[9,4,9,8],[15,5,15,8],[14,5,14,8],[13,4,13,8],[12,4,12,8],[8,6,8,8],[10,4,10,8],[99,5,99,6],[100,2,100,11],[28,6,28,8],[26,1,26,2],[26,3,26,4],[26,6,26,8],[24,3,24,5],[27,10,27,11],[27,5,27,8],[11,6,11,8],[50,6,50,8],[1,9,3,9],[5,4,5,8],[6,4,6,8],[1,1,1,3],[0,4,0,10],[2,5,2,6],[2,7,2,8],[4,6,4,8],[3,3,3,4],[0,1,0,3],[3,5,3,7],[1,5,1,8]]}
[null,"ANALYZING THE ANNUAL REPORT ",null,null,"This page shows year over year comparisons--see the graphs for 5 quarter and 5 year comparisons",null,null,null,null,null,null,"version 9.34",null,{"$f":"IF(COUNT(rngEarningsStatement)=8,\"         It appears no Refresh is required\",\"Earnings Data are missing--click the \"\"Refresh Data\"\" icon\")","v":"         It appears no Refresh is required"}]
[null,"Type a Ticker Symbol in blue colored cell & press Enter",null,null,"aapl",{"$f":"Data!D73","v":"Apple Inc"},null,null,null,"Graphs",null,null,null,null,null,null,null,null,null,null,null,null,null,{"$f":"IF(RevenuesThisYear=RevenuesLastYear,\"Caution: some data are not being reported correctly\",\"\")","v":""}]
[null,null,"The cheaper the paper, the more valuable the information -- Peter Lynch",null,null,null,null,"(Company)",null,null,{"$f":"IF(Data!G15=\"data missing\", \"It appears the most recent annual data are missing\", \"Financial Data from Zacks\")","v":"Financial Data from Zacks"},null,null,null,null,null,null,null,null,null,null,null,null,{"$f":"IF(RevenuesThisYear=RevenuesLastYear,\"It appears last year data and this year data are the same\",\"\")","v":""}]
[null,null,{"$f":"IF(D4=\"capitalization: SmallCap\",\"(Less than 1 Billion in sales)\",IF(D4=\"capitalization: MidCap\",\"(5 Billion to 10 Billion in sales)\",IF(D4=\"capitalization: largeCap\",\"(Over 10 Billion in sales)\")))","v":"(Over 10 Billion in sales)"},{"$f":"IF(Data!G40<=1000,\"Capitalization: SmallCap\",IF(Data!G40>=10000,\"Capitalization: LargeCap\",IF(Data!G40<500000,\"Capitalization: MidCap\",\"\")))","v":"Capitalization: LargeCap"},null,"Fiscal Year End date:",null,null,{"$f":"Data!C17","v":"2017-09-30"},null,{"$f":"IF(ISERROR(S75),\"\",S75)","v":52},"out of ",{"$f":"U75","v":100},{"$f":"IF(T75>693,\"CAUTION: DATA ARE MISSING. Close the spreadsheet and open it again.\",IF(T75=1,\"Caution: One data item is missing\",IF(ISERROR(K4),\"< #DIV/0 Indicates data are missing\",\"Total Points for this analysis\")))","v":"Total Points for this analysis"}]
[1,"Accounts Receivable",null,null,"Change:",{"$f":"IF(OR(X9<=0,COUNT(X8,X9)<2),0,(X8/X9)-1)","v":0.21755008703368706},{"$f":"IF(F5=0,\"No Accounts receivable data are reported for this company\",IF(F5>0.001,\"Oops - Wrong direction (Increasing)\",IF(F12<F5,\"Right direction, but Sales is declining faster\",IF(F5<0,\"OK!, Right direction (Decreasing)\",\"\"))))","v":"Oops - Wrong direction (Increasing)"},null,null,null,"Bullish Results",null,null,null,null,null,null,null,null,null,null,"SEE",null,"Millions","of dollars - except today's price"]
[null,null,"Days waiting for payment this year=",{"$f":"IF(ISNA(ARThisYear),\"N/A\",IF(OR(X22<=0,COUNT(X8,X22)<2),NA(),X8/(X22/365)))","v":56.800670930141251},{"$f":"IF(COUNT(F5)<1,\"\",IF(AND(F12>0,F5>0),\"Sales and Accounts Receivable are both increasing - If about equal, that's probably ok\",IF(F5>0,\"Rising Accts. Rec. means customers aren't paying their bills\",\"\")))","v":"Sales and Accounts Receivable are both increasing - If about equal, that's probably ok"},null,null,null,null,1,{"$f":"IF(F12>F5,\"Sales is increasing faster than Accts Receivable\",IF(F$5<0,\"Accounts Receivable is decreasing\",\"\"))","v":""},null,null,null,null,{"$f":"IF(K6=\"Sales is increasing faster than Accts Receivable\",Q6,0)","v":0},4,{"$f":"IF(ISNA(D6),\"N/A\",IF(D6<45,1,IF(D6<60,1,0)))","v":1},{"$f":"IF(T6=99,\"\",IF(R6>0,R6*3,0))","v":3},{"$f":"IF(ISERROR(R6),99,\"\")","v":""},4,{"$f":"IF(OR(K6=\"Sales is increasing faster than Accts Receivable\",K6=\"Accounts Receivable is decreasing\"),\"Line 1\",\"\")","v":""},null,null,"(from Balance Sheet)"]
[null,null,"Days waiting for payment prior year=",{"$f":"IF(OR(X23<=0,COUNT(X9,X23)<2),NA(),X9/(X23/365))","v":49.59276846952546},{"$f":"IF(ISNA(F5),\"N/A\",IF(AND(F5<0,F9>0),\"Accounts Receivable are decreasing but Inventories are increasing - why?\",IF(AND(F5>0,F9>0),\"Inventories are also increasing - are the increases substantial?\",IF(AND(F5<0,F9<0),\"Good - Both Accounts Receivable and Inventories are decreasing\",\"If Sales are increasing at a similar rate, good\"))))","v":"Inventories are also increasing - are the increases substantial?"},null,null,null,null,null,{"$f":"IF(ISERROR(F9),\"\",IF(F12>F9,\"Sales are growing faster than Inventories\",IF(F$9<0,\"Inventories are decreasing\",\"\")))","v":""},null,null,null,null,{"$f":"IF(K7=\"Sales are growing faster than Inventories\",Q7,0)","v":0},4,{"$f":"IF(E6=\"Sales and Accounts Receivable are both increasing - If about equal, that's probably ok\",1,0)","v":1},3,{"$f":"IF(ISERROR(R7),99,\"\")","v":""},4,{"$f":"IF(OR(K7=\"Sales are growing faster than inventories\",K7=\"Inventories are decreasing\"),\"Line 2\",\"\")","v":""},null,{"$f":"Data!C19","v":74181},"Cash & Cash Equivalents  "]
[null,null,null,"Below 60 is good - below 45 is superb)",null,null,null,null,null,"1a",{"$f":"IF(F$12>0,\"Sales are increasing\",\"\")","v":"Sales are increasing"},null,null,null,null,{"$f":"IF(K8=\"Sales are increasing\",Q8,0)","v":4},4,{"$f":"IF(G9=\"whoa, wrong direction (increasing)\",0,IF(G9=\"yes! - Right direction (Decreasing)\",1))","v":0},0,{"$f":"IF(ISERROR(R8),99,\"\")","v":""},4,{"$f":"IF(K8=\"Sales are increasing\",\"Line 3\",\"\")","v":"Line 3"},null,{"$f":"Data!M9","v":35673},"Accounts Receivable this year"]
[2,"Inventories",null,null,"Change:",{"$f":"IF(InventoriesThisYear=0,0,IF(OR(X11<=0,COUNT(X10,X11)<2),NA(),(X10/X11)-1))","v":1.2772045028142589},{"$f":"IF(F9=0,\"No Inventory data are reported for this company\",IF(COUNT(F9)<1,\"\",IF(F9>0.001,\"Whoa, wrong direction (Increasing)\",IF(F9<0,\"YES! - Right direction (Decreasing)\",\"\"))))","v":"Whoa, wrong direction (Increasing)"},null,null,null,{"$f":"IF(ISERROR(E15),\"\",IF(F$12>E$15,\"Sales are increasing faster than Cost of Sales\",\"\"))","v":"Sales are increasing faster than Cost of Sales"},null,null,null,null,{"$f":"IF(K9=\"Sales are increasing faster than Cost of Sales\",Q9,0)","v":4},4,{"$f":"IF(E10=\"CAUTION -- Both Accts. Receivable & Inventories are increasing\",0,IF(E10=\"Both Accts Rec. & Inventories are decreasing, that's positive.\",1,0))","v":0},0,"",4,{"$f":"IF(K9=\"Sales are increasing faster than Cost of Sales\",\"Line 4\",\"\")","v":"Line 4"},null,{"$f":"Data!L9","v":29299},"Accounts Receivable prior year"]
[null,null," Inventory Turnover Days this year =",{"$f":"Data!M27","v":9.4432131822863035},{"$f":"IF(COUNT(F9,F5)<2,\"\",IF(AND(F9>0,F5>0),\"CAUTION -- Both Accts. Receivable & Inventories are increasing\",IF(AND(F9<0,F5<0),\"Both Accts Rec. & Inventories are decreasing, that's positive.\",IF(F9>0,\"If Sales are flat or decreasing, Caution\",\"\"))))","v":"CAUTION -- Both Accts. Receivable & Inventories are increasing"},null,null,null,null,null,{"$f":"IF(ISERROR(F$21),\"This company has no long term debt\",IF(F$21<0,\"Debt is decreasing\",\"\"))","v":""},null,null,null,null,{"$f":"IF(K10=\"Debt is decreasing\",Q10,0)","v":0},4,{"$f":"IF(E11=\"CAUTION -- Both Accts. Receivable & Inventories are increasing\",0,IF(E11=\"Both Accts Rec. & Inventories are decreasing, that's positive.\",1,0))","v":0},{"$f":"IF(T10=99,\"\",IF(R10>0,R10*3,0))","v":0},"",3,{"$f":"IF(K10=\"Debt is decreasing\",\"Line 6\",\"\")","v":""},null,{"$f":"Data!M11","v":4855},"Inventories current year"]
{"$rows_left_out":93}
{"sheet":"Data","index":2,"n_rows":167,"n_cols":15,"rows_kept":167,"cut":false,"hidden":false,"merged":[]}
[null,{"$f":"Analysis!E2","v":"aapl"}]
[]
[null,"Annual Balance Sheet Data"]
[{"$f":"MATCH(B4,AnnBS!A$200:A$500,0)","v":189},"All items in Millions except Per Share data.",{"$f":"OFFSET(INDEX(AnnBS!$A$200:$M$500,$A4,COLUMN()-COLUMN($A4)),1,0)","v":"2017-09-30"},{"$f":"OFFSET(INDEX(AnnBS!$A$200:$M$500,$A4,COLUMN()-COLUMN($A4)),1,0)","v":"2016-09-30"},{"$f":"OFFSET(INDEX(AnnBS!$A$200:$M$500,$A4,COLUMN()-COLUMN($A4)),1,0)","v":"2015-09-30"},{"$f":"OFFSET(INDEX(AnnBS!$A$200:$M$500,$A4,COLUMN()-COLUMN($A4)),1,0)","v":"2014-09-30"},{"$f":"OFFSET(INDEX(AnnBS!$A$200:$M$500,$A4,COLUMN()-COLUMN($A4)),1,0)","v":"2013-09-30"},null,{"$f":"G4","v":"2013-09-30"},{"$f":"F4","v":"2014-09-30"},{"$f":"E4","v":"2015-09-30"},{"$f":"D4","v":"2016-09-30"},{"$f":"C4","v":"2017-09-30"}]
[{"$f":"MATCH(B5,AnnBS!A$200:A$500,0)","v":189},"All items in Millions except Per Share data.",{"$f":"OFFSET(INDEX(AnnBS!$A$200:$M$500,$A5,COLUMN()-COLUMN($A5)),1,0)","v":"2017-09-30"},{"$f":"OFFSET(INDEX(AnnBS!$A$200:$M$500,$A5,COLUMN()-COLUMN($A5)),1,0)","v":"2016-09-30"},{"$f":"OFFSET(INDEX(AnnBS!$A$200:$M$500,$A5,COLUMN()-COLUMN($A5)),1,0)","v":"2015-09-30"},{"$f":"OFFSET(INDEX(AnnBS!$A$200:$M$500,$A5,COLUMN()-COLUMN($A5)),1,0)","v":"2014-09-30"},{"$f":"OFFSET(INDEX(AnnBS!$A$200:$M$500,$A5,COLUMN()-COLUMN($A5)),1,0)","v":"2013-09-30"}]
[]
[{"$f":"MATCH(B7,AnnBS!A$200:A$500,0)","v":192},"Cash & Equivalents",{"$f":"INDEX(AnnBS!$A$200:$M$500,$A7,COLUMN()-COLUMN($A7))","v":74181},{"$f":"INDEX(AnnBS!$A$200:$M$500,$A7,COLUMN()-COLUMN($A7))","v":67155},{"$f":"INDEX(AnnBS!$A$200:$M$500,$A7,COLUMN()-COLUMN($A7))","v":41601},{"$f":"INDEX(AnnBS!$A$200:$M$500,$A7,COLUMN()-COLUMN($A7))","v":25077},{"$f":"INDEX(AnnBS!$A$200:$M$500,$A7,COLUMN()-COLUMN($A7))","v":40546},null,{"$f":"G7","v":40546},{"$f":"F7","v":25077},{"$f":"E7","v":41601},{"$f":"D7","v":67155},{"$f":"C7","v":74181},"Annual data"]
[{"$f":"MATCH(B8,AnnBS!A$200:A$500,0)","v":{"$error":"#N/A"}},"  Marketable Securities",{"$f":"INDEX(AnnBS!$A$200:$M$500,$A8,COLUMN()-COLUMN($A8))","v":{"$error":"#N/A"}},{"$f":"INDEX(AnnBS!$A$200:$M$500,$A8,COLUMN()-COLUMN($A8))","v":{"$error":"#N/A"}},{"$f":"INDEX(AnnBS!$A$200:$M$500,$A8,COLUMN()-COLUMN($A8))","v":{"$error":"#N/A"}},{"$f":"INDEX(AnnBS!$A$200:$M$500,$A8,COLUMN()-COLUMN($A8))","v":{"$error":"#N/A"}},{"$f":"INDEX(AnnBS!$A$200:$M$500,$A8,COLUMN()-COLUMN($A8))","v":{"$error":"#N/A"}},null,{"$f":"IF(C8=\"--\",0,C8)","v":{"$error":"#N/A"}},{"$f":"IF(D8=\"--\",0,D8)","v":{"$error":"#N/A"}},{"$error":"#N/A"},{"$error":"#N/A"},{"$error":"#N/A"},"Annual data"]
[{"$f":"MATCH(B9,AnnBS!A$200:A$500,0)","v":193},"Receivables",{"$f":"INDEX(AnnBS!$A$200:$M$500,$A9,COLUMN()-COLUMN($A9))","v":35673},{"$f":"INDEX(AnnBS!$A$200:$M$500,$A9,COLUMN()-COLUMN($A9))","v":29299},{"$f":"INDEX(AnnBS!$A$200:$M$500,$A9,COLUMN()-COLUMN($A9))","v":30343},{"$f":"INDEX(AnnBS!$A$200:$M$500,$A9,COLUMN()-COLUMN($A9))","v":27219},{"$f":"INDEX(AnnBS!$A$200:$M$500,$A9,COLUMN()-COLUMN($A9))","v":20641},null,{"$f":"G9","v":20641},{"$f":"F9","v":27219},{"$f":"E9","v":30343},{"$f":"D9","v":29299},{"$f":"C9","v":35673},"Annual data"]
[{"$f":"MATCH(B10,AnnBS!A$200:A$500,0)","v":195},"Inventories",{"$f":"INDEX(AnnBS!$A$200:$M$500,$A10,COLUMN()-COLUMN($A10))","v":4855},{"$f":"INDEX(AnnBS!$A$200:$M$500,$A10,COLUMN()-COLUMN($A10))","v":2132},{"$f":"INDEX(AnnBS!$A$200:$M$500,$A10,COLUMN()-COLUMN($A10))","v":2349},{"$f":"INDEX(AnnBS!$A$200:$M$500,$A10,COLUMN()-COLUMN($A10))","v":2111},{"$f":"INDEX(AnnBS!$A$200:$M$500,$A10,COLUMN()-COLUMN($A10))","v":1764},null,{"$f":"G10","v":1764},{"$f":"F10","v":2111},{"$f":"E10","v":2349},{"$f":"D10","v":2132},{"$f":"C10","v":4855},"Annual data"]
{"$rows_left_out":158}
{"sheet":"AnnBS","index":3,"n_rows":540,"n_cols":16,"rows_kept":540,"cut":false,"hidden":true,"merged":[]}
[{"$f":"Analysis!E2","v":"aapl"}]
["Zacks Investment Research"]
[]
["Join"]
["Sign In"]
["Member Sign In"]
["Keep Me Signed In What does \"Remember Me\" do?"]
["Forgot Password"]
["Create a New Account"]
[]
{"$rows_left_out":531}
{"sheet":"Name","index":4,"n_rows":110,"n_cols":2,"rows_kept":110,"cut":false,"hidden":true,"merged":[]}
[{"$f":"Analysis!E2","v":"aapl"},"http://financials.morningstar.com/company-profile/c.action?t=CCL&region=USA&culture=en_US"]
[]
["start logo"]
["Welcome!"]
["Company News Company Site Premium Log In"]
["end logo start leaderboard ads"]
["end leaderboard ads start main navigation"]
["Membership Home Portfolio Stocks Bonds Funds ETFs CEF Markets Tools Real Life Finance Discuss"]
["start sub navigation"]
["Investing Ideas"]
{"$rows_left_out":101}
{"sheet":"Income","index":5,"n_rows":496,"n_cols":10,"rows_kept":496,"cut":false,"hidden":true,"merged":[]}
[{"$f":"Analysis!E2","v":"aapl"}]
["Zacks Investment Research"]
[]
["Join"]
["Sign In"]
["Member Sign In"]
["Keep Me Signed In What does \"Remember Me\" do?"]
["Forgot Password"]
["Create a New Account"]
[]
{"$rows_left_out":487}
{"sheet":"Bond rate","index":6,"n_rows":291,"n_cols":4,"rows_kept":291,"cut":false,"hidden":true,"merged":[]}
[null,"http://www.bankrate.com/rates/interest-rates/treasury.aspx?ec_id=m1108343&s_kwcid=AL!1325!10!755415317!7018561280&ef_id=VEqRkgAAAagJjRd7:20141024175838:s"]
["Mortgages"]
[]
["Compare Lenders"]
[]
[]
["Mortgage rates"]
["Refinance rates"]
["Home equity loan rates"]
["Mortgage lender reviews"]
{"$rows_left_out":282}
{"sheet":"10 Yr PE","index":7,"n_rows":194,"n_cols":2,"rows_kept":194,"cut":false,"hidden":true,"merged":[]}
[]
["S&P 500 PE Ratio"]
["Shiller PE Ratio"]
["10 Year Treasury Rate"]
["S&P 500 Dividend Yield"]
["S&P 500 Earnings"]
["S&P 500 Historical Prices"]
["more"]
["multpl"]
[]
{"$rows_left_out":185}
{"sheet":"Price2","index":8,"n_rows":561,"n_cols":16,"rows_kept":561,"cut":false,"hidden":true,"merged":[]}
[{"$f":"Analysis!E2","v":"aapl"}]
["Subscribe Now Sign In"]
["The Wall Street Journal"]
["2018-07-31"]
["Todays Paper"]
[]
["Home "]
["World "]
["U.S. "]
["Politics "]
{"$rows_left_out":552}
{"sheet":"CFlow","index":9,"n_rows":476,"n_cols":6,"rows_kept":476,"cut":false,"hidden":true,"merged":[]}
[{"$f":"Analysis!E2","v":"aapl"}]
["Zacks Investment Research"]
[]
["Join"]
["Sign In"]
["Member Sign In"]
["Keep Me Signed In What does \"Remember Me\" do?"]
["Forgot Password"]
["Create a New Account"]
[]
{"$rows_left_out":467}
{"sheet":"G-1","index":10,"n_rows":36,"n_cols":7,"rows_kept":36,"cut":false,"hidden":false,"merged":[[37,0,37,14],[15,6,15,8],[17,0,17,14],[33,6,33,8],[35,0,35,14]]}
[]
[]
[]
[]
[]
[]
[]
[]
[]
[]
{"$rows_left_out":27}
{"sheet":"G-1a","index":11,"n_rows":35,"n_cols":7,"rows_kept":35,"cut":false,"hidden":false,"merged":[[15,6,15,8],[34,6,34,8],[17,0,17,13],[18,0,18,13]]}
[]
[]
[]
[]
[]
[]
[]
[]
[]
[]
{"$rows_left_out":26}
{"sheet":"G-2","index":12,"n_rows":20,"n_cols":6,"rows_kept":20,"cut":false,"hidden":false,"merged":[[17,5,17,8],[14,0,14,6],[15,0,15,14],[19,0,19,6]]}
[]
[]
[]
[]
[]
[]
[]
[]
[]
[]
{"$rows_left_out":11}
{"sheet":"G-2a","index":13,"n_rows":17,"n_cols":6,"rows_kept":17,"cut":false,"hidden":false,"merged":[[16,5,16,7],[14,0,14,14]]}
[]
[]
[]
[]
[]
[]
[]
[]
[]
[]
{"$rows_left_out":8}
{"sheet":"G-3","index":14,"n_rows":33,"n_cols":9,"rows_kept":33,"cut":false,"hidden":false,"merged":[[34,8,34,14],[34,2,34,4],[15,0,15,14],[16,0,16,14],[18,5,18,8],[21,8,21,14],[32,0,32,6]]}
[]
[]
[]
[]
[]
[]
[]
[]
[]
[]
{"$rows_left_out":24}
{"sheet":"G-3a","index":15,"n_rows":20,"n_cols":9,"rows_kept":20,"cut":false,"hidden":false,"merged":[[19,5,19,8],[15,0,15,13],[14,4,14,6],[14,8,14,14]]}
[]
[]
[]
[]
[]
[]
[]
[]
[]
[]
{"$rows_left_out":11}
{"sheet":"G-4","index":16,"n_rows":26,"n_cols":9,"rows_kept":26,"cut":false,"hidden":false,"merged":[[25,0,25,6],[21,0,21,6],[22,0,22,6],[23,0,23,6],[24,0,24,6],[15,6,15,8],[17,0,17,6],[20,0,20,6],[18,0,18,6],[17,8,17,14]]}
[]
[]
[]
[]
[]
[]
[]
[]
[]
[]
{"$rows_left_out":17}
{"sheet":"G-5","index":17,"n_rows":18,"n_cols":9,"rows_kept":18,"cut":false,"hidden":true,"merged":[[14,0,14,6],[14,8,14,14],[17,5,17,8],[16,0,16,8]]}
[]
[]
[]
[]
[]
[]
[]
[]
[]
[]
{"$rows_left_out":9}
{"sheet":"G-5a","index":18,"n_rows":18,"n_cols":7,"rows_kept":18,"cut":false,"hidden":false,"merged":[[14,0,14,14],[17,6,17,8]]}
[]
[]
[]
[]
[]
[]
[]
[]
[]
[]
{"$rows_left_out":9}
{"sheet":"G-6","index":19,"n_rows":38,"n_cols":10,"rows_kept":38,"cut":false,"hidden":false,"merged":[[37,4,37,7],[38,4,38,6],[15,0,15,12],[16,0,16,12],[17,0,17,12],[19,0,19,5],[18,6,18,7],[19,9,19,12]]}
[]
[]
[]
[]
[]
[]
[]
[]
[]
[]
{"$rows_left_out":29}
{"sheet":"G-6a","index":20,"n_rows":19,"n_cols":6,"rows_kept":19,"cut":false,"hidden":false,"merged":[[18,5,18,7],[14,0,14,14],[15,0,15,14],[16,0,16,14]]}
[]
[]
[]
[]
[]
[]
[]
[]
[]
[]
{"$rows_left_out":10}
{"sheet":"G-7","index":21,"n_rows":17,"n_cols":6,"rows_kept":17,"cut":false,"hidden":true,"merged":[[16,5,16,7],[14,0,14,14]]}
[]
[]
[]
[]
[]
[]
[]
[]
[]
[]
{"$rows_left_out":8}
{"sheet":"G-7a","index":22,"n_rows":17,"n_cols":6,"rows_kept":17,"cut":false,"hidden":false,"merged":[[14,0,14,14],[16,5,16,7]]}
[]
[]
[]
[]
[]
[]
[]
[]
[]
[]
{"$rows_left_out":8}
{"sheet":"G-8","index":23,"n_rows":18,"n_cols":6,"rows_kept":18,"cut":false,"hidden":false,"merged":[[17,5,17,7],[15,0,15,6],[15,8,15,14]]}
[]
[]
[]
[]
[]
[]
[]
[]
[]
[]
{"$rows_left_out":9}
{"sheet":"G-9","index":24,"n_rows":22,"n_cols":6,"rows_kept":22,"cut":false,"hidden":false,"merged":[[14,3,14,12],[21,5,21,7],[15,0,15,14],[16,0,16,14],[17,0,17,14],[18,0,19,14]]}
[]
[]
[]
[]
[]
[]
[]
[]
[]
[]
{"$rows_left_out":12}